MeSO2 anion
- Formula: CH3O2S-
- Molecular weight: 79.099

Reaction thermochemistry data

Data compiled by: John E. Bartmess
Individual Reactions
By formula: CH3O2S- + H+ = CH4O2S
Quantity | Value | Units | Method | Reference | Comment |
---|---|---|---|---|---|
ΔrH° | 1371. ± 22. | kJ/mol | G+TS | Sorensen | gas phase; Between CF2HCO2H and CF3CO2H. |
Quantity | Value | Units | Method | Reference | Comment |
ΔrG° | 1341. ± 22. | kJ/mol | IMRB | Sorensen | gas phase; Between CF2HCO2H and CF3CO2H. |

Gas phase ion energetics data

Data compiled by: John E. Bartmess
Protonation reactions
By formula: CH3O2S- + H+ = CH4O2S
Quantity | Value | Units | Method | Reference | Comment |
---|---|---|---|---|---|
ΔrH° | 1371. ± 22. | kJ/mol | G+TS | Sorensen | gas phase; Between CF2HCO2H and CF3CO2H. |
Quantity | Value | Units | Method | Reference | Comment |
ΔrG° | 1341. ± 22. | kJ/mol | IMRB | Sorensen | gas phase; Between CF2HCO2H and CF3CO2H. |

References

Sorensen
Sorensen, D.,
, Thesis, Univ. of Tennessee. [all data]