''bismuth tetroxide'' anion

Gas phase thermochemistry data

Data compiled by: John E. Bartmess

Quantity Value Units Method Reference Comment
Δfgas-181. ± 10.kJ/molIMREKuznetsova, Semenikhin, et al., 1992value altered from reference due to conversion from electron convention to ion convention

References

Kuznetsova, Semenikhin, et al., 1992
Kuznetsova, O.V.; Semenikhin, V.I.; Rudnyi, E.B.; Sidorov, L.N., Determination of the Formation of BiO-Ions and BiO2-Ions by the Ion-Molecular Equilibria Technique, Zh. Fiz. Khim. SSSR, 1992, 66, 3160. [all data]