Sulfur hexafluoride anion
- Formula: F6S-
- Molecular weight: 146.056

Reaction thermochemistry data

Data compiled by: John E. Bartmess
Individual Reactions
By formula: F6S- + F6S = (F6S- • F6S)
Quantity | Value | Units | Method | Reference | Comment |
---|---|---|---|---|---|
ΔrH° | 9.6 ± 1.3 | kJ/mol | TDAs | Hiraoka, Shimizu, et al., 1995 | gas phase; Entropy estimated. Gaff=+0.37 at 141K |
Quantity | Value | Units | Method | Reference | Comment |
ΔrG° | -13.0 ± 1.3 | kJ/mol | TDAs | Hiraoka, Shimizu, et al., 1995 | gas phase; Entropy estimated. Gaff=+0.37 at 141K |
By formula: F6S- + C6H4FNO2 = (F6S- • C6H4FNO2)
Quantity | Value | Units | Method | Reference | Comment |
---|---|---|---|---|---|
ΔrH° | 65.7 ± 4.2 | kJ/mol | TDAs | Chowdhury and Kebarle, 1986 | gas phase |
Quantity | Value | Units | Method | Reference | Comment |
ΔrG° | 33. ± 6.7 | kJ/mol | TDAs | Chowdhury and Kebarle, 1986 | gas phase |
By formula: F6S- + C7H4F3NO2 = (F6S- • C7H4F3NO2)
Quantity | Value | Units | Method | Reference | Comment |
---|---|---|---|---|---|
ΔrH° | 71.1 ± 4.2 | kJ/mol | TDAs | Chowdhury and Kebarle, 1986 | gas phase |
Quantity | Value | Units | Method | Reference | Comment |
ΔrG° | 38. ± 6.7 | kJ/mol | TDAs | Chowdhury and Kebarle, 1986 | gas phase |
By formula: F6S- + C6H5NO2 = (F6S- • C6H5NO2)
Quantity | Value | Units | Method | Reference | Comment |
---|---|---|---|---|---|
ΔrH° | 62.3 ± 4.2 | kJ/mol | TDAs | Chowdhury and Kebarle, 1986 | gas phase |
Quantity | Value | Units | Method | Reference | Comment |
ΔrG° | 28. ± 6.7 | kJ/mol | TDAs | Chowdhury and Kebarle, 1986 | gas phase |

Ion clustering data

Data compiled by: John E. Bartmess
Clustering reactions
By formula: F6S- + C6H4FNO2 = (F6S- • C6H4FNO2)
Quantity | Value | Units | Method | Reference | Comment |
---|---|---|---|---|---|
ΔrH° | 65.7 ± 4.2 | kJ/mol | TDAs | Chowdhury and Kebarle, 1986 | gas phase |
Quantity | Value | Units | Method | Reference | Comment |
ΔrG° | 33. ± 6.7 | kJ/mol | TDAs | Chowdhury and Kebarle, 1986 | gas phase |
By formula: F6S- + C6H5NO2 = (F6S- • C6H5NO2)
Quantity | Value | Units | Method | Reference | Comment |
---|---|---|---|---|---|
ΔrH° | 62.3 ± 4.2 | kJ/mol | TDAs | Chowdhury and Kebarle, 1986 | gas phase |
Quantity | Value | Units | Method | Reference | Comment |
ΔrG° | 28. ± 6.7 | kJ/mol | TDAs | Chowdhury and Kebarle, 1986 | gas phase |
By formula: F6S- + C7H4F3NO2 = (F6S- • C7H4F3NO2)
Quantity | Value | Units | Method | Reference | Comment |
---|---|---|---|---|---|
ΔrH° | 71.1 ± 4.2 | kJ/mol | TDAs | Chowdhury and Kebarle, 1986 | gas phase |
Quantity | Value | Units | Method | Reference | Comment |
ΔrG° | 38. ± 6.7 | kJ/mol | TDAs | Chowdhury and Kebarle, 1986 | gas phase |
By formula: F6S- + F6S = (F6S- • F6S)
Quantity | Value | Units | Method | Reference | Comment |
---|---|---|---|---|---|
ΔrH° | 9.6 ± 1.3 | kJ/mol | TDAs | Hiraoka, Shimizu, et al., 1995 | gas phase; Entropy estimated. Gaff=+0.37 at 141K |
Quantity | Value | Units | Method | Reference | Comment |
ΔrG° | -13.0 ± 1.3 | kJ/mol | TDAs | Hiraoka, Shimizu, et al., 1995 | gas phase; Entropy estimated. Gaff=+0.37 at 141K |

Gas phase thermochemistry data

Data compiled by: John E. Bartmess
Quantity | Value | Units | Method | Reference | Comment |
---|---|---|---|---|---|
ΔfH°gas | -315.6 ± 2.3 | kcal/mol | R-EA | Grimsrud, Chowdhury, et al., 1985 | ΔGea(423 K) = -29.8 kcal/mol; ΔSea = +13 eu. See also Chowdhury, Heinis, et al., 1986, Bopp, Roscioli, et al., 2007 |
ΔfH°gas | <-313.00 | kcal/mol | CIDT | Refaey and Franklin, 1978 |

References

Hiraoka, Shimizu, et al., 1995
Hiraoka, K.; Shimizu, A.; Minamitsu, A.; Nasu, M.; Fujimaki, S.; Yamabe, S.,
The small binding energies of the negative cluster ions: SF5-(SF6)1, SF6-(SF6)1 and F-(SF6)n (n=1 and 2), in the gas phase,
Chem. Phys. Lett., 1995, 241, 5-6, 623, https://doi.org/10.1016/0009-2614(95)00676-U
. [all data]
Chowdhury and Kebarle, 1986
Chowdhury, S.; Kebarle, P.,
Role of Binding Energies in A-.B and A.B- Complexes in the Kinetics of Gas Phase Electron Transfer Reactions:A- + B = A + B- Involving Perfluoro Compounds: SF6, C6F11CF3,
J. Chem. Phys., 1986, 85, 9, 4989, https://doi.org/10.1063/1.451687
. [all data]