H2O..SO5 radical anion

Reaction thermochemistry data

Data compiled by: John E. Bartmess

Individual Reactions

CAS Reg. No. 12509-93-2 + Water = H2O6S-

By formula: CAS Reg. No. 12509-93-2 + H2O = H2O6S-

Quantity Value Units Method Reference Comment
Δr17.2 ± 0.84kJ/molIMREMöhler, Reiner, et al., 1992gas phase

References

Möhler, Reiner, et al., 1992
Möhler, O.; Reiner, T.; Arnold, F., The Formation of SO5(-) by Gas Phase Ion-Molecule Reactions, J. Chem. Phys., 1992, 97, 11, 8233, https://doi.org/10.1063/1.463394 . [all data]