(NdCl3)2..NdCl4 anion

Ion clustering data

Data compiled by: John E. Bartmess

Clustering reactions

Cl4Nd- + 2Cl3Nd = Cl10Nd3-

By formula: Cl4Nd- + 2Cl3Nd = Cl10Nd3-

Quantity Value Units Method Reference Comment
Δr423. ± 46.kJ/molTDAsKudin, Pogrebnoi, et al., 1993gas phase

References

Kudin, Pogrebnoi, et al., 1993
Kudin, L.S.; Pogrebnoi, A.M.; Burdukovskaya, G.G., Mass-Spectrometric Study of Saturated Vapor Composition over Neodymium Chlorides .2. Ion-Molecular Equilibrium and Enthalpies of Formation of Formation of Positive and Negative Ions., Zh. Fiz. Khim. SSSR, 1993, 67, 908. [all data]