NdCl2..NdCl3 anion
- Formula: Cl5Nd2-
- Molecular weight: 465.750

Gas phase thermochemistry data

Data compiled by: John E. Bartmess
Quantity | Value | Units | Method | Reference | Comment |
---|---|---|---|---|---|
ΔfH°gas | -380.2 ± 5.5 | kcal/mol | Ther | Kudin, Pogrebnoi, et al., 1993 | value altered from reference due to conversion from electron convention to ion convention |

Reaction thermochemistry data

Data compiled by: John E. Bartmess
Individual Reactions
By formula: Cl3Nd- + Cl2Nd = Cl5Nd2-
Quantity | Value | Units | Method | Reference | Comment |
---|---|---|---|---|---|
ΔrH° | 88.2 ± 5.3 | kcal/mol | TDAs | Kudin, Pogrebnoi, et al., 1993 | gas phase; value altered from reference due to conversion from electron convention to ion convention |

Ion clustering data

Data compiled by: John E. Bartmess
Clustering reactions
By formula: Cl3Nd- + Cl2Nd = Cl5Nd2-
Quantity | Value | Units | Method | Reference | Comment |
---|---|---|---|---|---|
ΔrH° | 88.2 ± 5.3 | kcal/mol | TDAs | Kudin, Pogrebnoi, et al., 1993 | gas phase; value altered from reference due to conversion from electron convention to ion convention |

References

Kudin, Pogrebnoi, et al., 1993
Kudin, L.S.; Pogrebnoi, A.M.; Burdukovskaya, G.G.,
Mass-Spectrometric Study of Saturated Vapor Composition over Neodymium Chlorides .2. Ion-Molecular Equilibrium and Enthalpies of Formation of Formation of Positive and Negative Ions.,
Zh. Fiz. Khim. SSSR, 1993, 67, 908. [all data]