boron carbide anion
- Formula: CB-
- Molecular weight: 22.822

Gas phase thermochemistry data

Data compiled by: John E. Bartmess
Quantity | Value | Units | Method | Reference | Comment |
---|---|---|---|---|---|
ΔfH°gas | <142. ± 10. | kcal/mol | R-EA | Reid, 1993 | EA probably 64.6 kcal/mol. |

References

Reid, 1993
Reid, C.J.,
Electron Affinities of BH, B2, BC, and BN molecules determined using Charge Inversion Spectrometry,
Int. J. Mass Spectrom. Ion Proc., 1993, 127, 147, https://doi.org/10.1016/0168-1176(93)87087-9
. [all data]