BH radical anion
- Formula: BH-
- Molecular weight: 11.819

Gas phase thermochemistry data

Data compiled by: John E. Bartmess
Quantity | Value | Units | Method | Reference | Comment |
---|---|---|---|---|---|
ΔfH°gas | 417. ± 25. | kJ/mol | R-EA | Reid, 1993 |

Gas phase ion energetics data

Data compiled by: John E. Bartmess
Protonation reactions
HB- + = H2B
Quantity | Value | Units | Method | Reference | Comment |
---|---|---|---|---|---|
ΔrH° | 1629. ± 28. | kJ/mol | D-EA | Reid, 1993 | gas phase |

References

Reid, 1993
Reid, C.J.,
Electron Affinities of BH, B2, BC, and BN molecules determined using Charge Inversion Spectrometry,
Int. J. Mass Spectrom. Ion Proc., 1993, 127, 147, https://doi.org/10.1016/0168-1176(93)87087-9
. [all data]