yttrium anion

Gas phase thermochemistry data

Data compiled by: John E. Bartmess

Quantity Value Units Method Reference Comment
Δfgas391.6 ± 2.4kJ/molR-EAFeigerle, Herman, et al., 1981

References

Feigerle, Herman, et al., 1981
Feigerle, C.S.; Herman, Z.; Lineberger, W.C., Laser Photoelectron Spectroscopy of Sc- and Y-: A Determination of the Order of Electron Filling in Transition Metal Anions, J. Electron Spectros. Rel. Phenom., 1981, 23, 3, 441, https://doi.org/10.1016/0368-2048(81)85050-5 . [all data]