L-Lysine anion
- Formula: C6H13N2O2-
- Molecular weight: 145.1802

Gas phase ion energetics data

Data compiled by: John E. Bartmess
Electron affinity of neutral species
EAneutral (eV) | Method | Reference | Comment |
---|---|---|---|
3.87 ± 0.19 | D-EA | O'Hair, Bowie, et al., 1992 |
Protonation reactions
By formula: C6H13N2O2- + H+ = C6H14N2O2
Quantity | Value | Units | Method | Reference | Comment |
---|---|---|---|---|---|
ΔrH° | 338.4 ± 1.7 | kcal/mol | CIDC | Jones, Bernier, et al., 2007 | gas phase |
ΔrH° | 337.3 ± 3.1 | kcal/mol | G+TS | O'Hair, Bowie, et al., 1992 | gas phase |
Quantity | Value | Units | Method | Reference | Comment |
ΔrG° | 330.5 ± 3.0 | kcal/mol | CIDC | O'Hair, Bowie, et al., 1992 | gas phase |

Ion clustering data

Data compiled by: John E. Bartmess
Clustering reactions
C6H13N2O2- + = C6H15N2O3-
By formula: C6H13N2O2- + H2O = C6H15N2O3-
Quantity | Value | Units | Method | Reference | Comment |
---|---|---|---|---|---|
ΔrH° | 14.50 ± 0.60 | kcal/mol | N/A | Wincel, 2008 | gas phase |
Quantity | Value | Units | Method | Reference | Comment |
ΔrG° | 7.2 ± 1.0 | kcal/mol | TDAs | Wincel, 2008 | gas phase |

Reaction thermochemistry data

Data compiled by: John E. Bartmess

Individual Reactions

C6H13N2O2- + Hydrogen cation = Lysine

By formula: C6H13N2O2- + H+ = C6H14N2O2

Quantity Value Units Method Reference Comment
Δr1416. ± 7.1kJ/molCIDCJones, Bernier, et al., 2007gas phase
Δr1411. ± 13.kJ/molG+TSO'Hair, Bowie, et al., 1992gas phase
Quantity Value Units Method Reference Comment
Δr1383. ± 13.kJ/molCIDCO'Hair, Bowie, et al., 1992gas phase

C6H13N2O2- + Water = C6H15N2O3-

By formula: C6H13N2O2- + H2O = C6H15N2O3-

Quantity Value Units Method Reference Comment
Δr60.7 ± 2.5kJ/molN/AWincel, 2008gas phase
Quantity Value Units Method Reference Comment
Δr30. ± 4.2kJ/molTDAsWincel, 2008gas phase

References

O'Hair, Bowie, et al., 1992
O'Hair, R.J.; Bowie, J.H.; Gronert, S.,
Gas Phase Acidity of the alpha-Amino Acids,
Int. J. Mass Spectrom. Ion Proc., 1992, 117, 23, https://doi.org/10.1016/0168-1176(92)80083-D
. [all data]
Jones, Bernier, et al., 2007
Jones, C.M.; Bernier, M.; Carson, E.; Colyer, K.E.; Metz, R.; Pawlow, A.; Wischow, E.D.; Webb, I.; Andriole, E.J.; Poutsma, J.C.,
Gas-phase Acities of the 20 Protein Amino Acids,
Int. J. Mass Spectrom., 2007, 267, 1-3, 54-62, https://doi.org/10.1016/j.ijms.2007.02.018
. [all data]
Wincel, 2008
Wincel, H.,
Hydration energies of deprotonated amino acids from gas phase equilibria measurements,
J. Am. Soc. Mass Spectrom., 2008, 19, 8, 1091-1097, https://doi.org/10.1016/j.jasms.2008.05.014
. [all data]