L-Leucine anion
- Formula: C6H12NO2-
- Molecular weight: 130.1655

Reaction thermochemistry data

Data compiled by: John E. Bartmess
Individual Reactions
By formula: C6H12NO2- + H+ = C6H13NO2
Quantity | Value | Units | Method | Reference | Comment |
---|---|---|---|---|---|
ΔrH° | 1419. ± 10. | kJ/mol | CIDC | Jones, Bernier, et al., 2007 | gas phase |
ΔrH° | 1418. ± 13. | kJ/mol | G+TS | O'Hair, Bowie, et al., 1992 | gas phase |
Quantity | Value | Units | Method | Reference | Comment |
ΔrG° | 1390. ± 13. | kJ/mol | CIDC | O'Hair, Bowie, et al., 1992 | gas phase |

Gas phase ion energetics data

Data compiled by: John E. Bartmess
Electron affinity of neutral species
EAneutral (eV) | Method | Reference | Comment |
---|---|---|---|
3.80 ± 0.19 | D-EA | O'Hair, Bowie, et al., 1992 |
Protonation reactions
By formula: C6H12NO2- + H+ = C6H13NO2
Quantity | Value | Units | Method | Reference | Comment |
---|---|---|---|---|---|
ΔrH° | 1419. ± 10. | kJ/mol | CIDC | Jones, Bernier, et al., 2007 | gas phase |
ΔrH° | 1418. ± 13. | kJ/mol | G+TS | O'Hair, Bowie, et al., 1992 | gas phase |
Quantity | Value | Units | Method | Reference | Comment |
ΔrG° | 1390. ± 13. | kJ/mol | CIDC | O'Hair, Bowie, et al., 1992 | gas phase |

References

Jones, Bernier, et al., 2007
Jones, C.M.; Bernier, M.; Carson, E.; Colyer, K.E.; Metz, R.; Pawlow, A.; Wischow, E.D.; Webb, I.; Andriole, E.J.; Poutsma, J.C.,
Gas-phase Acities of the 20 Protein Amino Acids,
Int. J. Mass Spectrom., 2007, 267, 1-3, 54-62, https://doi.org/10.1016/j.ijms.2007.02.018
. [all data]
O'Hair, Bowie, et al., 1992
O'Hair, R.J.; Bowie, J.H.; Gronert, S.,
Gas Phase Acidity of the alpha-Amino Acids,
Int. J. Mass Spectrom. Ion Proc., 1992, 117, 23, https://doi.org/10.1016/0168-1176(92)80083-D
. [all data]