L-Glutamine anion
- Formula: C5H9N2O3-
- Molecular weight: 145.1371

Gas phase ion energetics data

Data compiled by: John E. Bartmess
Electron affinity of neutral species
EAneutral (eV) | Method | Reference | Comment |
---|---|---|---|
4.12 ± 0.19 | D-EA | O'Hair, Bowie, et al., 1992 |
Protonation reactions
By formula: C5H9N2O3- + H+ = C5H10N2O3
Quantity | Value | Units | Method | Reference | Comment |
---|---|---|---|---|---|
ΔrH° | 331.0 ± 2.6 | kcal/mol | CIDC | Jones, Bernier, et al., 2007 | gas phase |
ΔrH° | 331.6 ± 3.1 | kcal/mol | G+TS | O'Hair, Bowie, et al., 1992 | gas phase |
Quantity | Value | Units | Method | Reference | Comment |
ΔrG° | 324.8 ± 3.0 | kcal/mol | CIDC | O'Hair, Bowie, et al., 1992 | gas phase |

Ion clustering data

Data compiled by: John E. Bartmess
Clustering reactions
C5H9N2O3- + = C5H11N2O4-
By formula: C5H9N2O3- + H2O = C5H11N2O4-
Quantity | Value | Units | Method | Reference | Comment |
---|---|---|---|---|---|
ΔrH° | 14.40 ± 0.40 | kcal/mol | N/A | Wincel, 2008 | gas phase |
Quantity | Value | Units | Method | Reference | Comment |
ΔrG° | 5.40 ± 0.80 | kcal/mol | TDAs | Wincel, 2008 | gas phase |

Reaction thermochemistry data

Data compiled by: John E. Bartmess

Individual Reactions

C5H9N2O3- + Hydrogen cation = L-Glutamine

By formula: C5H9N2O3- + H+ = C5H10N2O3

Quantity Value Units Method Reference Comment
Δr1385. ± 11.kJ/molCIDCJones, Bernier, et al., 2007gas phase
Δr1387. ± 13.kJ/molG+TSO'Hair, Bowie, et al., 1992gas phase
Quantity Value Units Method Reference Comment
Δr1359. ± 13.kJ/molCIDCO'Hair, Bowie, et al., 1992gas phase

C5H9N2O3- + Water = C5H11N2O4-

By formula: C5H9N2O3- + H2O = C5H11N2O4-

Quantity Value Units Method Reference Comment
Δr60.2 ± 1.7kJ/molN/AWincel, 2008gas phase
Quantity Value Units Method Reference Comment
Δr22.6 ± 3.3kJ/molTDAsWincel, 2008gas phase

References

O'Hair, Bowie, et al., 1992
O'Hair, R.J.; Bowie, J.H.; Gronert, S.,
Gas Phase Acidity of the alpha-Amino Acids,
Int. J. Mass Spectrom. Ion Proc., 1992, 117, 23, https://doi.org/10.1016/0168-1176(92)80083-D
. [all data]
Jones, Bernier, et al., 2007
Jones, C.M.; Bernier, M.; Carson, E.; Colyer, K.E.; Metz, R.; Pawlow, A.; Wischow, E.D.; Webb, I.; Andriole, E.J.; Poutsma, J.C.,
Gas-phase Acities of the 20 Protein Amino Acids,
Int. J. Mass Spectrom., 2007, 267, 1-3, 54-62, https://doi.org/10.1016/j.ijms.2007.02.018
. [all data]
Wincel, 2008
Wincel, H.,
Hydration energies of deprotonated amino acids from gas phase equilibria measurements,
J. Am. Soc. Mass Spectrom., 2008, 19, 8, 1091-1097, https://doi.org/10.1016/j.jasms.2008.05.014
. [all data]