L-Threonine anion

Reaction thermochemistry data

Data compiled by: John E. Bartmess

Individual Reactions

C4H8NO3- + Hydrogen cation = Threonine

By formula: C4H8NO3- + H+ = C4H9NO3

Quantity Value Units Method Reference Comment
Δr1388. ± 10.kJ/molCIDCJones, Bernier, et al., 2007gas phase
Δr1389. ± 13.kJ/molG+TSO'Hair, Bowie, et al., 1992gas phase
Quantity Value Units Method Reference Comment
Δr1361. ± 13.kJ/molCIDCO'Hair, Bowie, et al., 1992gas phase

References

Jones, Bernier, et al., 2007
Jones, C.M.; Bernier, M.; Carson, E.; Colyer, K.E.; Metz, R.; Pawlow, A.; Wischow, E.D.; Webb, I.; Andriole, E.J.; Poutsma, J.C., Gas-phase Acities of the 20 Protein Amino Acids, Int. J. Mass Spectrom., 2007, 267, 1-3, 54-62, https://doi.org/10.1016/j.ijms.2007.02.018 . [all data]

O'Hair, Bowie, et al., 1992
O'Hair, R.J.; Bowie, J.H.; Gronert, S., Gas Phase Acidity of the alpha-Amino Acids, Int. J. Mass Spectrom. Ion Proc., 1992, 117, 23, https://doi.org/10.1016/0168-1176(92)80083-D . [all data]