L-Asparagine anion
- Formula: C4H7N2O3-
- Molecular weight: 131.1105

Gas phase ion energetics data

Data compiled by: John E. Bartmess
Electron affinity of neutral species
EAneutral (eV) | Method | Reference | Comment |
---|---|---|---|
4.14 ± 0.16 | D-EA | Jones, Bernier, et al., 2007 |
Protonation reactions
By formula: C4H7N2O3- + H+ = C4H8N2O3
Quantity | Value | Units | Method | Reference | Comment |
---|---|---|---|---|---|
ΔrH° | 331.0 ± 2.2 | kcal/mol | CIDC | Jones, Bernier, et al., 2007 | gas phase |
ΔrH° | 331.6 ± 3.1 | kcal/mol | G+TS | O'Hair, Bowie, et al., 1992 | gas phase |
Quantity | Value | Units | Method | Reference | Comment |
ΔrG° | 324.2 ± 2.3 | kcal/mol | H-TS | Jones, Bernier, et al., 2007 | gas phase |
ΔrG° | 324.8 ± 3.0 | kcal/mol | CIDC | O'Hair, Bowie, et al., 1992 | gas phase |

Ion clustering data

Data compiled by: John E. Bartmess
Clustering reactions
C4H7N2O3- + = C4H9N2O4-
By formula: C4H7N2O3- + H2O = C4H9N2O4-
Quantity | Value | Units | Method | Reference | Comment |
---|---|---|---|---|---|
ΔrH° | 12.30 ± 0.50 | kcal/mol | N/A | Wincel, 2008 | gas phase |
Quantity | Value | Units | Method | Reference | Comment |
ΔrG° | 4.4 ± 1.1 | kcal/mol | TDAs | Wincel, 2008 | gas phase |

References

Jones, Bernier, et al., 2007
Jones, C.M.; Bernier, M.; Carson, E.; Colyer, K.E.; Metz, R.; Pawlow, A.; Wischow, E.D.; Webb, I.; Andriole, E.J.; Poutsma, J.C.,
Gas-phase Acities of the 20 Protein Amino Acids,
Int. J. Mass Spectrom., 2007, 267, 1-3, 54-62, https://doi.org/10.1016/j.ijms.2007.02.018
. [all data]
O'Hair, Bowie, et al., 1992
O'Hair, R.J.; Bowie, J.H.; Gronert, S.,
Gas Phase Acidity of the alpha-Amino Acids,
Int. J. Mass Spectrom. Ion Proc., 1992, 117, 23, https://doi.org/10.1016/0168-1176(92)80083-D
. [all data]
Wincel, 2008
Wincel, H.,
Hydration energies of deprotonated amino acids from gas phase equilibria measurements,
J. Am. Soc. Mass Spectrom., 2008, 19, 8, 1091-1097, https://doi.org/10.1016/j.jasms.2008.05.014
. [all data]