1-vinylcyclopropanide anion
- Formula: C5H7-
- Molecular weight: 67.1096
- IUPAC Standard InChIKey: PAAQITHASMEPIA-UHFFFAOYSA-N
- Chemical structure:
View 3d structure (requires JavaScript / HTML 5) - Permanent link for this species. Use this link for bookmarking this species for future reference.

Reaction thermochemistry data

Data compiled by: John E. Bartmess
Individual Reactions
Quantity | Value | Units | Method | Reference | Comment |
---|---|---|---|---|---|
ΔrH° | 1647. ± 13. | kJ/mol | G+TS | Guo and Kass, 1992 | gas phase; Between Me2NH, H2O |
Quantity | Value | Units | Method | Reference | Comment |
ΔrG° | 1617. ± 13. | kJ/mol | IMRB | Guo and Kass, 1992 | gas phase; Between Me2NH, H2O |

Gas phase ion energetics data

Data compiled by: John E. Bartmess
Protonation reactions
Quantity | Value | Units | Method | Reference | Comment |
---|---|---|---|---|---|
ΔrH° | 1647. ± 13. | kJ/mol | G+TS | Guo and Kass, 1992 | gas phase; Between Me2NH, H2O |
Quantity | Value | Units | Method | Reference | Comment |
ΔrG° | 1617. ± 13. | kJ/mol | IMRB | Guo and Kass, 1992 | gas phase; Between Me2NH, H2O |

References

Guo and Kass, 1992
Guo, H.Z.; Kass, S.R.,
Vinylcyclopropyl Anion - Structure, Reactivity, Thermodynamic Properties, and an Unusual Rearrangement,
J. Am. Chem. Soc., 1992, 114, 4, 1244, https://doi.org/10.1021/ja00030a019
. [all data]