VO3 radical anion

Gas phase ion energetics data

Data compiled by: John E. Bartmess

Electron affinity of neutral species

EAneutral (eV) Method Reference Comment
4.360 ± 0.050LPESWu and Wang, 1998

References

Wu and Wang, 1998
Wu, H.; Wang, L.-S., A Photoelectron Spectroscopic Study of Monovanadium Oxide Anions (VOx-, x=1-4), J. Phys. Chem., 1998, 108, 13, 5310, https://doi.org/10.1063/1.475966 . [all data]