HP2 anion
- Formula: HP2-
- Molecular weight: 62.95601

Gas phase ion energetics data

Data compiled by: John E. Bartmess
Electron affinity of neutral species
EAneutral (eV) | Method | Reference | Comment |
---|---|---|---|
1.514 ± 0.010 | LPES | Ervin and Lineberger, 2005 |
Protonation reactions
HP2- + = H2P2
Quantity | Value | Units | Method | Reference | Comment |
---|---|---|---|---|---|
ΔrH° | 1490. ± 13. | kJ/mol | G+TS | O'Hair, Krempp, et al., 1992 | gas phase; Acidity between MeNO2, tBuSH |
Quantity | Value | Units | Method | Reference | Comment |
ΔrG° | 1456. ± 13. | kJ/mol | IMRB | O'Hair, Krempp, et al., 1992 | gas phase; Acidity between MeNO2, tBuSH |

References

Ervin and Lineberger, 2005
Ervin, K.M.; Lineberger, W.C.,
Photoelectron spectroscopy of phosphorus hydride anions,
J. Chem. Phys., 2005, 122, 19, 194303, https://doi.org/10.1063/1.1881153
. [all data]
O'Hair, Krempp, et al., 1992
O'Hair, R.A.J.; Krempp, M.; Damrauer, R.; Depuy, C.H.,
Gas-Phase Ion Chemistry of HP2(-), FP2(-), and HP2(+),
Inorg. Chem., 1992, 31, 11, 2092, https://doi.org/10.1021/ic00037a021
. [all data]