iron trifluoride anion
- Formula: F3Fe-
- Molecular weight: 112.841

Reaction thermochemistry data

Data compiled by: John E. Bartmess
Individual Reactions
By formula: F3Fe- + F2Fe = F5Fe2-
Quantity | Value | Units | Method | Reference | Comment |
---|---|---|---|---|---|
ΔrH° | 202. ± 37. | kJ/mol | TDEq | Sidirov, Borshchevsky, et al., 1986 | gas phase; value altered from reference due to conversion from electron convention to ion convention |
ΔrH° | 201. ± 4.2 | kJ/mol | TDAs | Sorokin, Sidorov, et al., 1981 | gas phase; ΔHf(A-) at 0 K; value altered from reference due to conversion from electron convention to ion convention |

Ion clustering data

Data compiled by: John E. Bartmess
Clustering reactions
By formula: F3Fe- + F2Fe = F5Fe2-
Quantity | Value | Units | Method | Reference | Comment |
---|---|---|---|---|---|
ΔrH° | 202. ± 37. | kJ/mol | TDEq | Sidirov, Borshchevsky, et al., 1986 | gas phase; value altered from reference due to conversion from electron convention to ion convention |
ΔrH° | 201. ± 4.2 | kJ/mol | TDAs | Sorokin, Sidorov, et al., 1981 | gas phase; ΔHf(A-) at 0 K; value altered from reference due to conversion from electron convention to ion convention |

Gas phase thermochemistry data

Data compiled by: John E. Bartmess

Quantity Value Units Method Reference Comment
Δfgas-254.0 ± 5.0kcal/molTherBorshchevskii, Boltalina, et al., 1988Fluoride Affinity: FeF2 < FeF3 by 22.6±2.6 kcal/mol.; value altered from reference due to conversion from electron convention to ion convention

References

Sidirov, Borshchevsky, et al., 1986
Sidirov, L.N.; Borshchevsky, A.Ya.; Boltalina, O.V.; Sorokin, I.D.; Skokan, E.V.,
Electron affinities of gaseous iron fluorides and dimers,
Int. J. Mass Spectrom. Ion Processes, 1986, 73, 1. [all data]
Sorokin, Sidorov, et al., 1981
Sorokin, I.D.; Sidorov, L.N.; Nikitin, M.I.; Skokan, E.V.,
Mass-spectrometric determination of the enthalpies of dissociation of gaseous complex fluorides into neutral and charged particles. V. Heats of formation of FeF3- and FeF4-,
Int. J. Mass Spectrom. Ion Phys., 1981, 41, 45. [all data]