diazirinide anion
- Formula: CHN2-
- Molecular weight: 41.0326

Reaction thermochemistry data

Data compiled by: John E. Bartmess
Individual Reactions
By formula: CHN2- + H+ = CH2N2
Quantity | Value | Units | Method | Reference | Comment |
---|---|---|---|---|---|
ΔrH° | 1681. ± 13. | kJ/mol | G+TS | Kroeker and Kass, 1990 | gas phase; Between MeNH2, EtNH2. The expt dHf(diazirine) disagrees with numerous l calculations by -14 kcal/mol |
Quantity | Value | Units | Method | Reference | Comment |
ΔrG° | 1648. ± 13. | kJ/mol | IMRB | Kroeker and Kass, 1990 | gas phase; Between MeNH2, EtNH2. The expt dHf(diazirine) disagrees with numerous l calculations by -14 kcal/mol |

Gas phase ion energetics data

Data compiled by: John E. Bartmess
Protonation reactions
By formula: CHN2- + H+ = CH2N2
Quantity | Value | Units | Method | Reference | Comment |
---|---|---|---|---|---|
ΔrH° | 1681. ± 13. | kJ/mol | G+TS | Kroeker and Kass, 1990 | gas phase; Between MeNH2, EtNH2. The expt dHf(diazirine) disagrees with numerous l calculations by -14 kcal/mol |
Quantity | Value | Units | Method | Reference | Comment |
ΔrG° | 1648. ± 13. | kJ/mol | IMRB | Kroeker and Kass, 1990 | gas phase; Between MeNH2, EtNH2. The expt dHf(diazirine) disagrees with numerous l calculations by -14 kcal/mol |

References

Kroeker and Kass, 1990
Kroeker, R.L.; Kass, S.R.,
Diazirinyl Anion: A Cyclic 4-pi Electron System,
J. Am. Chem. Soc., 1990, 112, 24, 9024, https://doi.org/10.1021/ja00180a082
. [all data]