TiF4..F anion

Gas phase thermochemistry data

Data compiled by: John E. Bartmess

Quantity Value Units Method Reference Comment
Δfgas-2155. ± 19.kJ/molTherBoltalina, Borshchevskii, et al., 1992Critical review; value altered from reference due to conversion from electron convention to ion convention

References

Boltalina, Borshchevskii, et al., 1992
Boltalina, O.V.; Borshchevskii, A.Y.; Sidorov, L.N., Thermochemistry of 3d Elements Fluorides and Their Negative Ions in Gas Phase, Russ. J. Phys. Chem., 1992, 66, 1223. [all data]