HoI3..HoI4 anion
- Formula: Ho2I7-
- Molecular weight: 1218.19248

Reaction thermochemistry data

Data compiled by: John E. Bartmess
Individual Reactions
By formula: HoI4- + HoI3 = Ho2I7-
Quantity | Value | Units | Method | Reference | Comment |
---|---|---|---|---|---|
ΔrH° | 45.40 | kcal/mol | TDAs | Bencze, Kaposi, et al., 1988 | gas phase; Data at 0 K. See also Pramann and Rademann, 1999; value altered from reference due to conversion from electron convention to ion convention |

Ion clustering data

Data compiled by: John E. Bartmess

Clustering reactions

HoI4- + HoI3 = Ho2I7-

By formula: HoI4- + HoI3 = Ho2I7-

Quantity Value Units Method Reference Comment
Δr45.40kcal/molTDAsBencze, Kaposi, et al., 1988gas phase; Data at 0 K. See also Pramann and Rademann, 1999; value altered from reference due to conversion from electron convention to ion convention

References

Bencze, Kaposi, et al., 1988
Bencze, L.; Kaposi, O.; Popovic, A.; Borshchevsky, Ya.A.; Sidorov, L.N.,
Molecule-Molecule and Negative Ion-Molecule Equilibria in the Saturated Vapor above CsI-HoI3 Mixtures,
High Temp. Sci., 1988, 25, 199. [all data]
Pramann and Rademann, 1999
Pramann, A.; Rademann, K.,
Mass-spectrometric study of formation and stability of manganese and manganese oxide cluster anions,
Int. J. Mass Spectrom., 1999, 187, 673-683, https://doi.org/10.1016/S1387-3806(98)14197-0
. [all data]