Tetrachloroethylene anion
- Formula: C2Cl4-
- Molecular weight: 165.834
- IUPAC Standard InChIKey: LTJYOGMKNGHXMZ-UHFFFAOYSA-N
- Chemical structure:
View 3d structure (requires JavaScript / HTML 5) - Permanent link for this species. Use this link for bookmarking this species for future reference.

Gas phase thermochemistry data

Data compiled by: John E. Bartmess
Quantity | Value | Units | Method | Reference | Comment |
---|---|---|---|---|---|
ΔfH°gas | -72.4 ± 8.8 | kJ/mol | R-EA | Chen, Wiley, et al., 1994 | The experimental HOF of C2Cl4 has been questioned as being too positive: Curtiss, Raghavachari, et al., 7374,11CHA/DEN |

References

Chen, Wiley, et al., 1994
Chen, E.C.M.; Wiley, J.R.; Batten, C.F.; Wentworth, W.E.,
Determination of the Electron Affinities of Molecules Using Negative Ion Mass Spectrometry,
J. Phys. Chem., 1994, 98, 1, 88, https://doi.org/10.1021/j100052a016
. [all data]
Curtiss, Raghavachari, et al., 7374
Curtiss, L.A.; Raghavachari, K.; Redfern, P.C.; Pople, J.A.,
Assesment of Gaussian-3 and density Functional Theories for a larger experimental test set, J. Chem. Phys. 112 (2000), 7374. [all data]