trifluoronitrosomethane anion
- Formula: CF3NO-
- Molecular weight: 99.0126
- IUPAC Standard InChIKey: PCEAOHMXGACURY-UHFFFAOYSA-N
- Chemical structure:
View 3d structure (requires JavaScript / HTML 5) - Permanent link for this species. Use this link for bookmarking this species for future reference.

Gas phase thermochemistry data

Data compiled by: John E. Bartmess
Quantity | Value | Units | Method | Reference | Comment |
---|---|---|---|---|---|
ΔfH°gas | <-737. ± 28. | kJ/mol | R-EA | Harland, 1977 | From(CF3)2NO; G3MP2B3 calculations indicate an EA of ca. 1.7 eV |

References

Harland, 1977
Harland, P.W.,
Electron attachment to the stable free radical bis-trifluoromethylnitroxide in the gas phase,
Int. J. Mass Spectrom. Ion Phys., 1977, 25, 61. [all data]