2,3-diNO2-phenoxide anion
- Formula: C6H3N2O5-
- Molecular weight: 183.0990

Reaction thermochemistry data

Data compiled by: John E. Bartmess
Individual Reactions
By formula: C6H3N2O5- + H+ = C6H4N2O5
Quantity | Value | Units | Method | Reference | Comment |
---|---|---|---|---|---|
ΔrH° | 1324. ± 9.2 | kJ/mol | G+TS | Taft, 1991 | gas phase |
Quantity | Value | Units | Method | Reference | Comment |
ΔrG° | 1295. ± 8.4 | kJ/mol | IMRE | Taft, 1991 | gas phase |

Gas phase ion energetics data

Data compiled by: John E. Bartmess
Protonation reactions
By formula: C6H3N2O5- + H+ = C6H4N2O5
Quantity | Value | Units | Method | Reference | Comment |
---|---|---|---|---|---|
ΔrH° | 1324. ± 9.2 | kJ/mol | G+TS | Taft, 1991 | gas phase |
Quantity | Value | Units | Method | Reference | Comment |
ΔrG° | 1295. ± 8.4 | kJ/mol | IMRE | Taft, 1991 | gas phase |

References

Taft, 1991
Taft, R.W.,
, personal communication, Aug, 1991. [all data]