2,2,6,6-Me4-piperidinide anion
- Formula: C9H18N-
- Molecular weight: 140.2465

Gas phase ion energetics data

Data compiled by: John E. Bartmess
Electron affinity of neutral species
EAneutral (eV) | Method | Reference | Comment |
---|---|---|---|
0.803 ± 0.092 | D-EA | Grimm and Bartmess, 1992 |
Protonation reactions
By formula: C9H18N- + H+ = C9H19N
Quantity | Value | Units | Method | Reference | Comment |
---|---|---|---|---|---|
ΔrH° | 389.69 ± 0.72 | kcal/mol | G+TS | Grimm and Bartmess, 1992 | gas phase |
Quantity | Value | Units | Method | Reference | Comment |
ΔrG° | 382.30 ± 0.40 | kcal/mol | IMRE | Grimm and Bartmess, 1992 | gas phase |

References

Grimm and Bartmess, 1992
Grimm, D.T.; Bartmess, J.E.,
The Intrinsic (Gas Phase) Basicity of some Anions Commonly Used in Condensed-Phase Synthesis,
J. Am. Chem. Soc., 1992, 114, 4, 1227, https://doi.org/10.1021/ja00030a016
. [all data]