(MeO)2Si(Me)O anion
- Formula: C3H9O3Si-
- Molecular weight: 121.1878

Gas phase ion energetics data

Data compiled by: John E. Bartmess
Protonation reactions
C3H9O3Si- + = C3H10O3Si
By formula: C3H9O3Si- + H+ = C3H10O3Si
Quantity | Value | Units | Method | Reference | Comment |
---|---|---|---|---|---|
ΔrH° | 1484. ± 17. | kJ/mol | G+TS | Damrauer, Simon, et al., 1991 | gas phase; Between MeSH, tBuSH |
Quantity | Value | Units | Method | Reference | Comment |
ΔrG° | 1458. ± 17. | kJ/mol | IMRB | Damrauer, Simon, et al., 1991 | gas phase; Between MeSH, tBuSH |

Reaction thermochemistry data

Data compiled by: John E. Bartmess

Individual Reactions

C3H9O3Si- + Hydrogen cation = C3H10O3Si

By formula: C3H9O3Si- + H+ = C3H10O3Si

Quantity Value Units Method Reference Comment
Δr354.8 ± 4.1kcal/molG+TSDamrauer, Simon, et al., 1991gas phase; Between MeSH, tBuSH
Quantity Value Units Method Reference Comment
Δr348.4 ± 4.0kcal/molIMRBDamrauer, Simon, et al., 1991gas phase; Between MeSH, tBuSH

References

Damrauer, Simon, et al., 1991
Damrauer, R.; Simon, R.; Krempp, M.,
Effect of Substituents on the Gas-Phase Acidity of Silanols,
J. Am. Chem. Soc., 1991, 113, 12, 4431, https://doi.org/10.1021/ja00012a009
. [all data]