CF3COCH=C(CF3)O anion

Reaction thermochemistry data

Data compiled by: John E. Bartmess

Individual Reactions

C5HF6O2- + Hydrogen cation = 2,4-Pentanedione, 1,1,1,5,5,5-hexafluoro-

By formula: C5HF6O2- + H+ = C5H2F6O2

Quantity Value Units Method Reference Comment
Δr1328. ± 9.2kJ/molG+TSKoppel, Taft, et al., 1994gas phase
Quantity Value Units Method Reference Comment
Δr1298. ± 8.4kJ/molIMREKoppel, Taft, et al., 1994gas phase

References

Koppel, Taft, et al., 1994
Koppel, I.A.; Taft, R.W.; Anvia, F.; Zhu, S.Z.; Hu, L.Q.; Sung, K.S.; Desmarteau, D.D.; Yagupolskii, L.M., The Gas-Phase Acidities of Very Strong Neutral Bronsted Acids, J. Am. Chem. Soc., 1994, 116, 7, 3047, https://doi.org/10.1021/ja00086a038 . [all data]