MeSO3 anion
- Formula: CH3O3S-
- Molecular weight: 95.098

Reaction thermochemistry data

Data compiled by: John E. Bartmess
Individual Reactions
(CH3O3S- • 2) +
= (CH3O3S- • 3
)
By formula: (CH3O3S- • 2H2O) + H2O = (CH3O3S- • 3H2O)
Quantity | Value | Units | Method | Reference | Comment |
---|---|---|---|---|---|
ΔrH° | 47.7 ± 6.3 | kJ/mol | TDAs | Blades, Klassen, et al., 1995 | gas phase; T: 293 K. ΔSaff approx. 24 cal/mol-K |
Quantity | Value | Units | Method | Reference | Comment |
ΔrG° | 18.4 ± 1.3 | kJ/mol | TDAs | Blades, Klassen, et al., 1995 | gas phase; T: 293 K. ΔSaff approx. 24 cal/mol-K |
(CH3O3S- • ) +
= (CH3O3S- • 2
)
By formula: (CH3O3S- • H2O) + H2O = (CH3O3S- • 2H2O)
Quantity | Value | Units | Method | Reference | Comment |
---|---|---|---|---|---|
ΔrH° | 51.9 ± 6.3 | kJ/mol | TDAs | Blades, Klassen, et al., 1995 | gas phase; T: 293 K. ΔSaff approx. 24 cal/mol-K |
Quantity | Value | Units | Method | Reference | Comment |
ΔrG° | 22.6 ± 1.3 | kJ/mol | TDAs | Blades, Klassen, et al., 1995 | gas phase; T: 293 K. ΔSaff approx. 24 cal/mol-K |
By formula: CH3O3S- + H2O = (CH3O3S- • H2O)
Quantity | Value | Units | Method | Reference | Comment |
---|---|---|---|---|---|
ΔrH° | 58.2 ± 6.3 | kJ/mol | TDAs | Blades, Klassen, et al., 1995 | gas phase; T: 293 K. ΔSaff approx. 24 cal/mol-K |
Quantity | Value | Units | Method | Reference | Comment |
ΔrG° | 28.9 ± 1.3 | kJ/mol | TDAs | Blades, Klassen, et al., 1995 | gas phase; T: 293 K. ΔSaff approx. 24 cal/mol-K |
By formula: CH3O3S- + H+ = CH4O3S
Quantity | Value | Units | Method | Reference | Comment |
---|---|---|---|---|---|
ΔrH° | 1343. ± 9.2 | kJ/mol | G+TS | Koppel, Taft, et al., 1994 | gas phase |
Quantity | Value | Units | Method | Reference | Comment |
ΔrG° | 1318. ± 8.4 | kJ/mol | IMRE | Koppel, Taft, et al., 1994 | gas phase |
ΔrG° | 1321. ± 8.4 | kJ/mol | IMRE | Taft, Koppel, et al., 1990 | gas phase |

Gas phase ion energetics data

Data compiled by: John E. Bartmess
Protonation reactions
By formula: CH3O3S- + H+ = CH4O3S
Quantity | Value | Units | Method | Reference | Comment |
---|---|---|---|---|---|
ΔrH° | 1343. ± 9.2 | kJ/mol | G+TS | Koppel, Taft, et al., 1994 | gas phase |
Quantity | Value | Units | Method | Reference | Comment |
ΔrG° | 1318. ± 8.4 | kJ/mol | IMRE | Koppel, Taft, et al., 1994 | gas phase |
ΔrG° | 1321. ± 8.4 | kJ/mol | IMRE | Taft, Koppel, et al., 1990 | gas phase |

Ion clustering data

Data compiled by: John E. Bartmess
Clustering reactions
By formula: CH3O3S- + H2O = (CH3O3S- • H2O)
Quantity | Value | Units | Method | Reference | Comment |
---|---|---|---|---|---|
ΔrH° | 58.2 ± 6.3 | kJ/mol | TDAs | Blades, Klassen, et al., 1995 | gas phase; T: 293 K. ΔSaff approx. 24 cal/mol-K |
Quantity | Value | Units | Method | Reference | Comment |
ΔrG° | 28.9 ± 1.3 | kJ/mol | TDAs | Blades, Klassen, et al., 1995 | gas phase; T: 293 K. ΔSaff approx. 24 cal/mol-K |
(CH3O3S- • ) +
= (CH3O3S- • 2
)
By formula: (CH3O3S- • H2O) + H2O = (CH3O3S- • 2H2O)
Quantity | Value | Units | Method | Reference | Comment |
---|---|---|---|---|---|
ΔrH° | 51.9 ± 6.3 | kJ/mol | TDAs | Blades, Klassen, et al., 1995 | gas phase; T: 293 K. ΔSaff approx. 24 cal/mol-K |
Quantity | Value | Units | Method | Reference | Comment |
ΔrG° | 22.6 ± 1.3 | kJ/mol | TDAs | Blades, Klassen, et al., 1995 | gas phase; T: 293 K. ΔSaff approx. 24 cal/mol-K |
(CH3O3S- • 2) +
= (CH3O3S- • 3
)
By formula: (CH3O3S- • 2H2O) + H2O = (CH3O3S- • 3H2O)
Quantity | Value | Units | Method | Reference | Comment |
---|---|---|---|---|---|
ΔrH° | 47.7 ± 6.3 | kJ/mol | TDAs | Blades, Klassen, et al., 1995 | gas phase; T: 293 K. ΔSaff approx. 24 cal/mol-K |
Quantity | Value | Units | Method | Reference | Comment |
ΔrG° | 18.4 ± 1.3 | kJ/mol | TDAs | Blades, Klassen, et al., 1995 | gas phase; T: 293 K. ΔSaff approx. 24 cal/mol-K |

References

Blades, Klassen, et al., 1995
Blades, A.T.; Klassen, J.S.; Kebarle, P.,
Free Energies of Hydration in the Gas Phase on the Anions of Some Oxo Acids of C, N, S, P, Cl and I,
J. Am. Chem. Soc., 1995, 117, 42, 10563, https://doi.org/10.1021/ja00147a019
. [all data]
Koppel, Taft, et al., 1994
Koppel, I.A.; Taft, R.W.; Anvia, F.; Zhu, S.Z.; Hu, L.Q.; Sung, K.S.; Desmarteau, D.D.; Yagupolskii, L.M.,
The Gas-Phase Acidities of Very Strong Neutral Bronsted Acids,
J. Am. Chem. Soc., 1994, 116, 7, 3047, https://doi.org/10.1021/ja00086a038
. [all data]
Taft, Koppel, et al., 1990
Taft, R.W.; Koppel, I.J.; Topsom, R.D.; Anvia, F.,
Acidities of OH Compounds, including Alcohols, Phenols, Carboxylic Acids, and Mineral Acids,
J. Am. Chem. Soc., 1990, 112, 6, 2047, https://doi.org/10.1021/ja00162a001
. [all data]