tetrazolide anion

Reaction thermochemistry data

Data compiled by: John E. Bartmess

Individual Reactions

CHN4- + Hydrogen cation = 1H-Tetrazole

By formula: CHN4- + H+ = CH2N4

Quantity Value Units Method Reference Comment
Δr1396. ± 8.8kJ/molG+TSTaft, 1991gas phase
Quantity Value Units Method Reference Comment
Δr1366. ± 8.4kJ/molIMRETaft, 1991gas phase

Gas phase ion energetics data

Data compiled by: John E. Bartmess

Protonation reactions

CHN4- + Hydrogen cation = 1H-Tetrazole

By formula: CHN4- + H+ = CH2N4

Quantity Value Units Method Reference Comment
Δr1396. ± 8.8kJ/molG+TSTaft, 1991gas phase
Quantity Value Units Method Reference Comment
Δr1366. ± 8.4kJ/molIMRETaft, 1991gas phase

References

Taft, 1991
Taft, R.W., , personal communication, Aug, 1991. [all data]