1,2,4-triazolide anion
- Formula: C2H2N3-
- Molecular weight: 68.0579

Gas phase ion energetics data

Data compiled by: John E. Bartmess
Protonation reactions
By formula: C2H2N3- + H+ = C2H3N3
Quantity | Value | Units | Method | Reference | Comment |
---|---|---|---|---|---|
ΔrH° | 344.2 ± 2.1 | kcal/mol | G+TS | Taft, 1991 | gas phase |
Quantity | Value | Units | Method | Reference | Comment |
ΔrG° | 336.9 ± 2.0 | kcal/mol | IMRE | Taft, 1991 | gas phase |

References

Taft, 1991
Taft, R.W.,
, personal communication, Aug, 1991. [all data]