HN=C(Me)S anion
- Formula: C2H4NS-
- Molecular weight: 74.125

Reaction thermochemistry data

Data compiled by: John E. Bartmess
Individual Reactions
By formula: C2H4NS- + H+ = C2H5NS
Quantity | Value | Units | Method | Reference | Comment |
---|---|---|---|---|---|
ΔrH° | 1449. ± 8.8 | kJ/mol | G+TS | Decouzon, Exner, et al., 1994 | gas phase |
Quantity | Value | Units | Method | Reference | Comment |
ΔrG° | 1420. ± 8.4 | kJ/mol | IMRE | Decouzon, Exner, et al., 1994 | gas phase |

Gas phase ion energetics data

Data compiled by: John E. Bartmess
Electron affinity of neutral species
EAneutral (eV) | Method | Reference | Comment |
---|---|---|---|
2.52 ± 0.13 | D-EA | Decouzon, Exner, et al., 1994 |
Protonation reactions
By formula: C2H4NS- + H+ = C2H5NS
Quantity | Value | Units | Method | Reference | Comment |
---|---|---|---|---|---|
ΔrH° | 1449. ± 8.8 | kJ/mol | G+TS | Decouzon, Exner, et al., 1994 | gas phase |
Quantity | Value | Units | Method | Reference | Comment |
ΔrG° | 1420. ± 8.4 | kJ/mol | IMRE | Decouzon, Exner, et al., 1994 | gas phase |

References

Decouzon, Exner, et al., 1994
Decouzon, M.; Exner, O.; Gal, J.F.; Maria, P.C.; Waisser, K.,
Acidity and basicity of thiocarboxamides in the gas phase,
J. Phys. Org. Chem., 1994, 7, 9, 511, https://doi.org/10.1002/poc.610070907
. [all data]