9-OMe-fluorenide anion
- Formula: C14H11O-
- Molecular weight: 195.2371

Reaction thermochemistry data

Data compiled by: John E. Bartmess
Individual Reactions
By formula: C14H11O- + H+ = C14H12O
Quantity | Value | Units | Method | Reference | Comment |
---|---|---|---|---|---|
ΔrH° | 1469. ± 8.8 | kJ/mol | G+TS | Taft, 1991 | gas phase |
Quantity | Value | Units | Method | Reference | Comment |
ΔrG° | 1436. ± 8.4 | kJ/mol | IMRE | Taft, 1991 | gas phase |

Gas phase ion energetics data

Data compiled by: John E. Bartmess
Electron affinity of neutral species
EAneutral (eV) | Method | Reference | Comment |
---|---|---|---|
1.54 ± 0.13 | D-EA | Taft, 1991 |
Protonation reactions
By formula: C14H11O- + H+ = C14H12O
Quantity | Value | Units | Method | Reference | Comment |
---|---|---|---|---|---|
ΔrH° | 1469. ± 8.8 | kJ/mol | G+TS | Taft, 1991 | gas phase |
Quantity | Value | Units | Method | Reference | Comment |
ΔrG° | 1436. ± 8.4 | kJ/mol | IMRE | Taft, 1991 | gas phase |

References

Taft, 1991
Taft, R.W.,
, personal communication, Aug, 1991. [all data]