O2..O2 radical anion
- Formula: O4-
- Molecular weight: 63.9981

Gas phase thermochemistry data

Data compiled by: John E. Bartmess
Quantity | Value | Units | Method | Reference | Comment |
---|---|---|---|---|---|
ΔfH°gas | -87.2 ± 2.2 | kJ/mol | Ther | Hiraoka, 1888 | see also Sherwood, Hanold, et al., 1996. Aquino, Taylor, et al., 2001 calns indicate rectangular anion |

Reaction thermochemistry data

Data compiled by: John E. Bartmess
Individual Reactions
O4- + +
= N2O4-
By formula: O4- + N2 + O2 = N2O4-
Quantity | Value | Units | Method | Reference | Comment |
---|---|---|---|---|---|
ΔrH° | 12.1 ± 0.84 | kJ/mol | TDAs | Hiraoka, 1988 | gas phase |
Quantity | Value | Units | Method | Reference | Comment |
ΔrG° | -8.8 ± 2.1 | kJ/mol | TDAs | Hiraoka, 1988 | gas phase |

Gas phase ion energetics data

Data compiled by: John E. Bartmess
Electron affinity of neutral species
EAneutral (eV) | Method | Reference | Comment |
---|---|---|---|
<1.90 ± 0.20 | PD | Burt, 1972 |

Ion clustering data

Data compiled by: John E. Bartmess

Clustering reactions

O4- + Nitrogen + Oxygen = N2O4-

By formula: O4- + N2 + O2 = N2O4-

Quantity Value Units Method Reference Comment
Δr2.90 ± 0.20kcal/molTDAsHiraoka, 1988gas phase
Quantity Value Units Method Reference Comment
Δr-2.10 ± 0.50kcal/molTDAsHiraoka, 1988gas phase

References

Hiraoka, 1888
Hiraoka, K.,
A Determination of the Stability of O2+(O2)n and O2-(O2)n with n=1-8 from Measurements of the Gas Phase Ion Equilibria,
J. Chem. Phys., 1888, 89, 5, 3190, https://doi.org/10.1063/1.454976
. [all data]
Sherwood, Hanold, et al., 1996
Sherwood, C.R.; Hanold, K.A.; Garner, M.C.; Strong, K.M.; Continetti, R.E.,
Translational Spectroscopy Studies of the Photodissociation Dynamics of O4-,
J. Chem. Phys., 1996, 105, 24, 10803, https://doi.org/10.1063/1.472888
. [all data]
Aquino, Taylor, et al., 2001
Aquino, A.J.A.; Taylor, P.R.; Walch, S.P.,
Structure, properties, and photodissociation of O-4(-),
J. Chem. Phys., 2001, 114, 7, 3010-3017, https://doi.org/10.1063/1.1288379
. [all data]
Hiraoka, 1988
Hiraoka, K.,
Determination of the Stabilities of O3-(N2)n, O3-(O2)n, and O4-(N2)n from Measurements of the Gas Phase Equilibria,
Chem. Phys., 1988, 125, 2-3, 439, https://doi.org/10.1016/0301-0104(88)87096-4
. [all data]