germanium anion
- Formula: Ge-
- Molecular weight: 72.64

Gas phase thermochemistry data

Data compiled by: John E. Bartmess
Quantity | Value | Units | Method | Reference | Comment |
---|---|---|---|---|---|
ΔfH°gas | 248.9 ± 1.0 | kJ/mol | R-EA | Scheer, Bilodeau, et al., 1998 | Given: 1.232712(15) eV |

Reaction thermochemistry data

Data compiled by: John E. Bartmess
Individual Reactions
Quantity | Value | Units | Method | Reference | Comment |
---|---|---|---|---|---|
ΔrH° | 1457. ± 21. | kJ/mol | D-EA | Scheer, Bilodeau, et al., 1998 | gas phase; Given: 1.232712(15) eV |
Quantity | Value | Units | Method | Reference | Comment |
ΔrG° | 1434. ± 22. | kJ/mol | H-TS | Scheer, Bilodeau, et al., 1998 | gas phase; Given: 1.232712(15) eV |

Gas phase ion energetics data

Data compiled by: John E. Bartmess
Protonation reactions
Quantity | Value | Units | Method | Reference | Comment |
---|---|---|---|---|---|
ΔrH° | 1457. ± 21. | kJ/mol | D-EA | Scheer, Bilodeau, et al., 1998 | gas phase; Given: 1.232712(15) eV |
Quantity | Value | Units | Method | Reference | Comment |
ΔrG° | 1434. ± 22. | kJ/mol | H-TS | Scheer, Bilodeau, et al., 1998 | gas phase; Given: 1.232712(15) eV |

References

Scheer, Bilodeau, et al., 1998
Scheer, M.; Bilodeau, R.C.; Brodie, C.A.; Haugen, H.K.,
Systematic study of the stable states of C-, Si-, Ge-, and Sn- via infrared laser spectroscopy,
Phys. Rev. A, 1998, 58, 4, 2844-2856, https://doi.org/10.1103/PhysRevA.58.2844
. [all data]