3,4-diMe-pyrazolide anion
- Formula: C5H7N2-
- Molecular weight: 95.1230

Gas phase ion energetics data

Data compiled by: John E. Bartmess
Protonation reactions
By formula: C5H7N2- + H+ = C5H8N2
Quantity | Value | Units | Method | Reference | Comment |
---|---|---|---|---|---|
ΔrH° | 1488. ± 8.8 | kJ/mol | G+TS | Taft, 1991 | gas phase |
Quantity | Value | Units | Method | Reference | Comment |
ΔrG° | 1456. ± 8.4 | kJ/mol | IMRE | Taft, 1991 | gas phase |

Reaction thermochemistry data

Data compiled by: John E. Bartmess
Individual Reactions
By formula: C5H7N2- + H+ = C5H8N2
Quantity | Value | Units | Method | Reference | Comment |
---|---|---|---|---|---|
ΔrH° | 355.7 ± 2.1 | kcal/mol | G+TS | Taft, 1991 | gas phase |
Quantity | Value | Units | Method | Reference | Comment |
ΔrG° | 348.0 ± 2.0 | kcal/mol | IMRE | Taft, 1991 | gas phase |

References

Taft, 1991
Taft, R.W.,
, personal communication, Aug, 1991. [all data]