3,4,5-triMe-pyrazolide anion
- Formula: C6H9N2-
- Molecular weight: 109.1496

Reaction thermochemistry data

Data compiled by: John E. Bartmess
Individual Reactions
By formula: C6H9N2- + H+ = C6H10N2
Quantity | Value | Units | Method | Reference | Comment |
---|---|---|---|---|---|
ΔrH° | 356.6 ± 2.1 | kcal/mol | G+TS | Taft, 1991 | gas phase |
Quantity | Value | Units | Method | Reference | Comment |
ΔrG° | 349.3 ± 2.0 | kcal/mol | IMRE | Taft, 1991 | gas phase |

Gas phase ion energetics data

Data compiled by: John E. Bartmess
Protonation reactions
By formula: C6H9N2- + H+ = C6H10N2
Quantity | Value | Units | Method | Reference | Comment |
---|---|---|---|---|---|
ΔrH° | 356.6 ± 2.1 | kcal/mol | G+TS | Taft, 1991 | gas phase |
Quantity | Value | Units | Method | Reference | Comment |
ΔrG° | 349.3 ± 2.0 | kcal/mol | IMRE | Taft, 1991 | gas phase |

References

Taft, 1991
Taft, R.W.,
, personal communication, Aug, 1991. [all data]