(CF3)3CNH anion
- Formula: C4HF9N-
- Molecular weight: 234.0436

Gas phase ion energetics data

Data compiled by: John E. Bartmess
Protonation reactions
By formula: C4HF9N- + H+ = C4H2F9N
Quantity | Value | Units | Method | Reference | Comment |
---|---|---|---|---|---|
ΔrH° | 1495. ± 8.8 | kJ/mol | G+TS | Koppel, Taft, et al., 1994 | gas phase |
Quantity | Value | Units | Method | Reference | Comment |
ΔrG° | 1465. ± 8.4 | kJ/mol | IMRE | Koppel, Taft, et al., 1994 | gas phase |

Reaction thermochemistry data

Data compiled by: John E. Bartmess

Individual Reactions

C4HF9N- + Hydrogen cation = Perfluoro-tert-butylamine

By formula: C4HF9N- + H+ = C4H2F9N

Quantity Value Units Method Reference Comment
Δr1495. ± 8.8kJ/molG+TSKoppel, Taft, et al., 1994gas phase
Quantity Value Units Method Reference Comment
Δr1465. ± 8.4kJ/molIMREKoppel, Taft, et al., 1994gas phase

References

Koppel, Taft, et al., 1994
Koppel, I.A.; Taft, R.W.; Anvia, F.; Zhu, S.Z.; Hu, L.Q.; Sung, K.S.; Desmarteau, D.D.; Yagupolskii, L.M.,
The Gas-Phase Acidities of Very Strong Neutral Bronsted Acids,
J. Am. Chem. Soc., 1994, 116, 7, 3047, https://doi.org/10.1021/ja00086a038
. [all data]