Carbonyl sulfide anion

Gas phase thermochemistry data

Data compiled by: John E. Bartmess

Quantity Value Units Method Reference Comment
Δfgas-187. ± 19.kJ/molR-EACompton, Reinhardt, et al., 1975See Surber, Ananthavel, et al., 2002, for a claim that EA<0; G3MP2B3 calculations indicate an EA of ca. -0.05 eV, unbound. At the bent geometry of the anion, G3MP2B3 EDE(vert)=0.35 eV bound. The experiment appears to be the vertical EA.

References

Compton, Reinhardt, et al., 1975
Compton, R.N.; Reinhardt, P.W.; Cooper, C.D., Collisional ionization of Na, K, and Cs by CO2, COS, and CS2: Molecular electron affinities, J. Chem. Phys., 1975, 63, 3821. [all data]

Surber, Ananthavel, et al., 2002
Surber, E.; Ananthavel, S.P.; Sanov, A., Nonexistent electron affinity of OCS and the stabilization of carbonyl sulfide anions by gas phase hydration, J. Chem. Phys., 2002, 116, 5, 1920-1929, https://doi.org/10.1063/1.1433001 . [all data]