HO(CH2)5O anion

Gas phase ion energetics data

Data compiled by: John E. Bartmess

Electron affinity of neutral species

EAneutral (eV) Method Reference Comment
2.67 ± 0.14D-EACrowder and Bartmess, 1993ΔGacid at 80°C

References

Crowder and Bartmess, 1993
Crowder, C.; Bartmess, J., The Gas Phase Acidities of Diols, J. Am. Soc. Mass Spectrom., 1993, 4, 9, 723, https://doi.org/10.1016/1044-0305(93)80051-Y . [all data]