HOCH2CH2CH2O anion
- Formula: C3H7O2-
- Molecular weight: 75.0870

Gas phase ion energetics data

Data compiled by: John E. Bartmess
Electron affinity of neutral species
EAneutral (eV) | Method | Reference | Comment |
---|---|---|---|
2.59 ± 0.14 | D-EA | Crowder and Bartmess, 1993 | ΔGacid at 80°C |

References

Crowder and Bartmess, 1993
Crowder, C.; Bartmess, J.,
The Gas Phase Acidities of Diols,
J. Am. Soc. Mass Spectrom., 1993, 4, 9, 723, https://doi.org/10.1016/1044-0305(93)80051-Y
. [all data]