Cr2 anion
- Formula: Cr2-
- Molecular weight: 103.9927

Gas phase thermochemistry data

Data compiled by: John E. Bartmess
Quantity | Value | Units | Method | Reference | Comment |
---|---|---|---|---|---|
ΔfH°gas | 605.8 ± 5.9 | kJ/mol | R-EA | Casey, Villata, et al., 1991 | See also Casey and Leopold, 1993 for more analysis. |

References

Casey, Villata, et al., 1991
Casey, S.M.; Villata, P.W.; Bengali, A.A.; Cheng, C.-L.; Dick, J.P.; Fenn, P.T.; Leopold, D.G.,
A Study of Cr2 by Negative ion Photoelectron Spectroscopy,
J. Am. Chem. Soc., 1991, 113, 17, 6688, https://doi.org/10.1021/ja00017a058
. [all data]
Casey and Leopold, 1993
Casey, S.M.; Leopold, D.G.,
Negative Ion Photoelectron Spectroscopy of Cr2,
J. Phys. Chem., 1993, 97, 4, 816, https://doi.org/10.1021/j100106a005
. [all data]