oNO2-benzoate anion
- Formula: C7H4NO4-
- Molecular weight: 166.1115

Reaction thermochemistry data

Data compiled by: John E. Bartmess
Individual Reactions
By formula: C7H4NO4- + H+ = C7H5NO4
Quantity | Value | Units | Method | Reference | Comment |
---|---|---|---|---|---|
ΔrH° | 1388. ± 9.2 | kJ/mol | G+TS | Yamdagni, McMahon, et al., 1974 | gas phase |
Quantity | Value | Units | Method | Reference | Comment |
ΔrG° | 1357. ± 8.4 | kJ/mol | IMRE | Yamdagni, McMahon, et al., 1974 | gas phase |

Gas phase ion energetics data

Data compiled by: John E. Bartmess
Electron affinity of neutral species
EAneutral (eV) | Method | Reference | Comment |
---|---|---|---|
3.81 ± 0.13 | D-EA | Yamdagni, McMahon, et al., 1974 |
Protonation reactions
By formula: C7H4NO4- + H+ = C7H5NO4
Quantity | Value | Units | Method | Reference | Comment |
---|---|---|---|---|---|
ΔrH° | 1388. ± 9.2 | kJ/mol | G+TS | Yamdagni, McMahon, et al., 1974 | gas phase |
Quantity | Value | Units | Method | Reference | Comment |
ΔrG° | 1357. ± 8.4 | kJ/mol | IMRE | Yamdagni, McMahon, et al., 1974 | gas phase |

References

Yamdagni, McMahon, et al., 1974
Yamdagni, R.; McMahon, T.B.; Kebarle, P.,
Substituent Effects on the Intrinsic Acidities of Benzoic Acids Determined by Gas Phase Proton Transfer Equilibria Measurements,
J. Am. Chem. Soc., 1974, 96, 12, 4035, https://doi.org/10.1021/ja00819a063
. [all data]