NCCH=C(OEt)O anion
- Formula: C5H6NO2-
- Molecular weight: 112.1072

Reaction thermochemistry data

Data compiled by: John E. Bartmess
Individual Reactions
By formula: C5H6NO2- + H+ = C5H7NO2
Quantity | Value | Units | Method | Reference | Comment |
---|---|---|---|---|---|
ΔrH° | 1422. ± 9.6 | kJ/mol | G+TS | Taft and Bordwell, 1988 | gas phase |
Quantity | Value | Units | Method | Reference | Comment |
ΔrG° | 1396. ± 8.4 | kJ/mol | IMRE | Taft and Bordwell, 1988 | gas phase |

Gas phase ion energetics data

Data compiled by: John E. Bartmess
Electron affinity of neutral species
EAneutral (eV) | Method | Reference | Comment |
---|---|---|---|
2.85 ± 0.13 | D-EA | Taft and Bordwell, 1988 |
Protonation reactions
By formula: C5H6NO2- + H+ = C5H7NO2
Quantity | Value | Units | Method | Reference | Comment |
---|---|---|---|---|---|
ΔrH° | 1422. ± 9.6 | kJ/mol | G+TS | Taft and Bordwell, 1988 | gas phase |
Quantity | Value | Units | Method | Reference | Comment |
ΔrG° | 1396. ± 8.4 | kJ/mol | IMRE | Taft and Bordwell, 1988 | gas phase |

References

Taft and Bordwell, 1988
Taft, R.W.; Bordwell, F.G.,
Structural and Solvent Effects Evaluated from Acidities Measured in Dimethyl Sulfoxide and in the Gas Phase,
Acc. Chem. Res., 1988, 21, 12, 463, https://doi.org/10.1021/ar00156a005
. [all data]