m-aza-anilide anion

Reaction thermochemistry data

Data compiled by: John E. Bartmess

Individual Reactions

C5H5N2- + Hydrogen cation = 3-Aminopyridine

By formula: C5H5N2- + H+ = C5H6N2

Quantity Value Units Method Reference Comment
Δr360.6 ± 2.1kcal/molG+TSTaft and Bordwell, 1988gas phase
Quantity Value Units Method Reference Comment
Δr353.3 ± 2.0kcal/molIMRETaft and Bordwell, 1988gas phase

References

Taft and Bordwell, 1988
Taft, R.W.; Bordwell, F.G., Structural and Solvent Effects Evaluated from Acidities Measured in Dimethyl Sulfoxide and in the Gas Phase, Acc. Chem. Res., 1988, 21, 12, 463, https://doi.org/10.1021/ar00156a005 . [all data]