chlorine fluoride anion
- Formula: ClF-
- Molecular weight: 54.452

Gas phase thermochemistry data

Data compiled by: John E. Bartmess
Quantity | Value | Units | Method | Reference | Comment |
---|---|---|---|---|---|
ΔfH°gas | -200. ± 29. | kJ/mol | R-EA | Dispert and Lacmann, 1978 | From CF2Cl2; G3MP2B3 calculations indicate an EA of ca. 2.1 eV |

References

Dispert and Lacmann, 1978
Dispert, H.; Lacmann, K.,
Negative ion formation in collisions between potassium and fluoro- and chloromethanes: Electron affinities and bond dissociation energies,
Int. J. Mass Spectrom. Ion Phys., 1978, 28, 49. [all data]