Si2H5 anion
- Formula: H5Si2-
- Molecular weight: 61.2112

Reaction thermochemistry data

Data compiled by: John E. Bartmess
Individual Reactions
By formula: H5Si2- + H+ = H6Si2
Quantity | Value | Units | Method | Reference | Comment |
---|---|---|---|---|---|
ΔrH° | <1312. ± 12. | kJ/mol | Acid | Krishnakumar and Srivastava, 1991 | gas phase; From Si2H6, AP = 0.0 eV/Data for SiH4 plus a-Si effects imply ΔHacid ca. 360. G3MP2B3 calculations give dHacid=360 kcal/mol |
Quantity | Value | Units | Method | Reference | Comment |
ΔrG° | <1275. ± 14. | kJ/mol | H-TS | Krishnakumar and Srivastava, 1991 | gas phase; From Si2H6, AP = 0.0 eV/Data for SiH4 plus a-Si effects imply ΔHacid ca. 360. G3MP2B3 calculations give dHacid=360 kcal/mol |

Gas phase ion energetics data

Data compiled by: John E. Bartmess
Protonation reactions
By formula: H5Si2- + H+ = H6Si2
Quantity | Value | Units | Method | Reference | Comment |
---|---|---|---|---|---|
ΔrH° | <1312. ± 12. | kJ/mol | Acid | Krishnakumar and Srivastava, 1991 | gas phase; From Si2H6, AP = 0.0 eV/Data for SiH4 plus a-Si effects imply ΔHacid ca. 360. G3MP2B3 calculations give dHacid=360 kcal/mol |
Quantity | Value | Units | Method | Reference | Comment |
ΔrG° | <1275. ± 14. | kJ/mol | H-TS | Krishnakumar and Srivastava, 1991 | gas phase; From Si2H6, AP = 0.0 eV/Data for SiH4 plus a-Si effects imply ΔHacid ca. 360. G3MP2B3 calculations give dHacid=360 kcal/mol |

References

Krishnakumar and Srivastava, 1991
Krishnakumar, E.; Srivastava, S.K.,
Dissociative Electron Attachment of Electrons with Si2H6,
Int. J. Mass Spectrom. Ion Proc., 1991, 103, 2-3, 107, https://doi.org/10.1016/0168-1176(91)80082-X
. [all data]