Benzene, 1-methyl-2,3-dinitro- anion
- Formula: C7H6N2O4-
- Molecular weight: 182.1341

Gas phase thermochemistry data

Data compiled by: John E. Bartmess
Quantity | Value | Units | Method | Reference | Comment |
---|---|---|---|---|---|
ΔfH°gas | >-36.4 ± 1.5 | kcal/mol | R-EA | Mock and Grimsrud, 1989 |

References

Mock and Grimsrud, 1989
Mock, R.S.; Grimsrud, E.P.,
Gas-Phase Electron Photodetachment Spectroscopy of the Molecular Anions of Nitroaromatic Hydrocarbons at Atmospheric Pressure,
J. Am. Chem. Soc., 1989, 111, 8, 2861, https://doi.org/10.1021/ja00190a020
. [all data]