Phthalic anhydride, tetrachloro- anion
- Formula: C8Cl4O3-
- Molecular weight: 285.896

Gas phase thermochemistry data

Data compiled by: John E. Bartmess
Quantity | Value | Units | Method | Reference | Comment |
---|---|---|---|---|---|
ΔfH°gas | -638. ± 19. | kJ/mol | R-EA | Paul and Kebarle, 1989 | ΔGea(423 K) = -43.8±1 kcal/mol, ΔS(est) = -3±3 eu |

References

Paul and Kebarle, 1989
Paul, G.; Kebarle, P.,
Electron Affinities of Cyclic Unsaturated Dicarbonyls: Maleic Anhydrides, Maleimides, and Cyclopentendione,
J. Am. Chem. Soc., 1989, 111, 2, 464, https://doi.org/10.1021/ja00184a009
. [all data]