4-Methyl isobenzofurandione anion

Gas phase thermochemistry data

Data compiled by: John E. Bartmess

Quantity Value Units Method Reference Comment
Δfgas-532. ± 12.kJ/molR-EAPaul and Kebarle, 1989ΔGea(423 K) = -26.8±1 kcal/mol, ΔS(est) =-3±3 eu

References

Paul and Kebarle, 1989
Paul, G.; Kebarle, P., Electron Affinities of Cyclic Unsaturated Dicarbonyls: Maleic Anhydrides, Maleimides, and Cyclopentendione, J. Am. Chem. Soc., 1989, 111, 2, 464, https://doi.org/10.1021/ja00184a009 . [all data]