2-Me-maleic anhydride radical anion
- Formula: C5H4O3-
- Molecular weight: 112.0840

Gas phase thermochemistry data

Data compiled by: John E. Bartmess
Quantity | Value | Units | Method | Reference | Comment |
---|---|---|---|---|---|
ΔfH°gas | -572.4 ± 9.2 | kJ/mol | R-EA | Paul and Kebarle, 1989 | ΔGea(423 K) = -29.5±1 kcal/mol, ΔS est. as -1±3 eu |

Gas phase ion energetics data

Data compiled by: John E. Bartmess
Electron affinity of neutral species
EAneutral (eV) | Method | Reference | Comment |
---|---|---|---|
1.297 ± 0.087 | IMRE | Paul and Kebarle, 1989 | ΔGea(423 K) = -29.5±1 kcal/mol, ΔS est. as -1±3 eu |

References

Paul and Kebarle, 1989
Paul, G.; Kebarle, P.,
Electron Affinities of Cyclic Unsaturated Dicarbonyls: Maleic Anhydrides, Maleimides, and Cyclopentendione,
J. Am. Chem. Soc., 1989, 111, 2, 464, https://doi.org/10.1021/ja00184a009
. [all data]